Cooper-n
type: LexicalEntry
canonical form: Cooper
sense: 10928879-n
part of speech: noun

James Fenimore Cooper-n
type: LexicalEntry
canonical form: James Fenimore Cooper
sense: 10928879-n
part of speech: noun

10928879-n
type: LexicalConcept
in scheme: en-word.net
definition: United States novelist noted for his stories of American Indians and the frontier life (1789-1851)
ili: i94781
lexfile: noun.person
part of speech: noun
instance hypernym: 10813654-n