Boswell-n
type: LexicalEntry
canonical form: Boswell
sense: 10878468-n
part of speech: noun

James Boswell-n
type: LexicalEntry
canonical form: James Boswell
sense: 10878468-n
part of speech: noun

10878468-n
type: LexicalConcept
in scheme: en-word.net
definition: Scottish author noted for his biography of Samuel Johnson (1740-1795)
ili: i94517
lexfile: noun.person
part of speech: noun
instance hypernym: 10813654-n