Barrymore-n
type: LexicalEntry
canonical form: Barrymore
sense: 10855305-n
part of speech: noun

Lionel Barrymore-n
type: LexicalEntry
canonical form: Lionel Barrymore
sense: 10855305-n
part of speech: noun

10855305-n
type: LexicalConcept
in scheme: en-word.net
definition: United States actor; son of Maurice Barrymore and Georgiana Barrymore (1878-1954)
ili: i94388
lexfile: noun.person
part of speech: noun
instance hypernym: 09784701-n