Alexander-n
type: LexicalEntry
canonical form: Alexander
sense: 10831964-n
part of speech: noun

Alexander the Great-n
type: LexicalEntry
canonical form: Alexander the Great
sense: 10831964-n
part of speech: noun

10831964-n
type: LexicalConcept
in scheme: en-word.net
definition: king of Macedon; conqueror of Greece and Egypt and Persia; founder of Alexandria (356-323 BC)
ili: i94270
lexfile: noun.person
part of speech: noun
instance hypernym: 09976057-n