widow-n
type: LexicalEntry
canonical form: widow
sense: 10799960-n
part of speech: noun

widow woman-n
type: LexicalEntry
canonical form: widow woman
sense: 10799960-n
part of speech: noun

10799960-n
type: LexicalConcept
in scheme: en-word.net
definition: a woman whose husband is dead especially one who has not remarried
ili: i94121
lexfile: noun.person
part of speech: noun
hypernym: 10807146-n