warrior-n
type: LexicalEntry
canonical form: warrior
sense: 10788253-n
part of speech: noun

10788253-n
type: LexicalConcept
in scheme: en-word.net
definition: someone engaged in or experienced in warfare
ili: i94040
lexfile: noun.person
part of speech: noun
hypernym: 09786620-n