usher-n
type: LexicalEntry
canonical form: usher
sense: 10761768-n
part of speech: noun

doorkeeper-n
type: LexicalEntry
canonical form: doorkeeper
sense: 10761768-n
part of speech: noun

10761768-n
type: LexicalConcept
in scheme: en-word.net
definition: an official stationed at the entrance of a courtroom or legislative chamber
ili: i93864
lexfile: noun.person
part of speech: noun
hypernym: 10392072-n