traitor-n
type: LexicalEntry
canonical form: traitor
sense: 10742614-n
part of speech: noun

treasonist-n
type: LexicalEntry
canonical form: treasonist
sense: 10742614-n
part of speech: noun

10742614-n
type: LexicalConcept
in scheme: en-word.net
definition: someone who betrays their country by committing treason
ili: i93735
lexfile: noun.person
part of speech: noun
exemplifies: 06730109-n
hypernym: 09997190-n