toast-n
type: LexicalEntry
canonical form: toast
sense: 10733016-n
part of speech: noun

10733016-n
type: LexicalConcept
in scheme: en-word.net
definition: a celebrity who receives much acclaim and attention
example: he was the toast of the town
ili: i93668
lexfile: noun.person
part of speech: noun
hypernym: 09922606-n