timekeeper-n
type: LexicalEntry
canonical form: timekeeper
sense: 10731132-n
part of speech: noun

timer-n
type: LexicalEntry
canonical form: timer
sense: 10731132-n
part of speech: noun

10731132-n
type: LexicalConcept
in scheme: en-word.net
definition: (sports) an official who keeps track of the time elapsed
ili: i93654
lexfile: noun.person
part of speech: noun
domain topic: 00524569-n
hypernym: 10391775-n