thief-n
type: LexicalEntry
canonical form: thief
sense: 10727453-n
part of speech: noun

stealer-n
type: LexicalEntry
canonical form: stealer
sense: 10727453-n
part of speech: noun

10727453-n
type: LexicalConcept
in scheme: en-word.net
definition: a criminal who takes property belonging to someone else with the intention of keeping it or selling it
ili: i93630
lexfile: noun.person
part of speech: noun
exemplifies: 06730109-n
hypernym: 09997190-n