solon-n
type: LexicalEntry
canonical form: solon
sense: 10669601-n
part of speech: noun

national leader-n
type: LexicalEntry
canonical form: national leader
sense: 10669601-n
part of speech: noun

10669601-n
type: LexicalConcept
in scheme: en-word.net
definition: a person who is a respected leader in national or international affairs
ili: i93293
lexfile: noun.person
part of speech: noun
hypernym: 10469877-n