stalking-horse-n
type: LexicalEntry
canonical form: stalking-horse
sense: 10666080-n
part of speech: noun

10666080-n
type: LexicalConcept
in scheme: en-word.net
definition: a candidate put forward to divide the Opposition or to mask the true candidate
ili: i93272
lexfile: noun.person
part of speech: noun
hypernym: 09909143-n