square-n
type: LexicalEntry
canonical form: square
sense: 10662243-n
part of speech: noun

square toes-n
type: LexicalEntry
canonical form: square toes
sense: 10662243-n
part of speech: noun

10662243-n
type: LexicalConcept
in scheme: en-word.net
definition: a formal and conservative person with old-fashioned views
ili: i93246
lexfile: noun.person
part of speech: noun
exemplifies: 07089193-n
hypernym: 09976635-n