spotter-n
type: LexicalEntry
canonical form: spotter
sense: 10659593-n
part of speech: noun

10659593-n
type: LexicalConcept
in scheme: en-word.net
definition: a worker employed to apply spots (as markers or identifiers)
ili: i93230
lexfile: noun.person
part of speech: noun
hypernym: 10073616-n