sort-n
type: LexicalEntry
canonical form: sort
sense: 10646084-n
part of speech: noun

10646084-n
type: LexicalConcept
in scheme: en-word.net
definition: a person of a particular character or nature
example: what sort of person is he?
example: he's a good sort
ili: i93158
lexfile: noun.person
part of speech: noun
hypernym: 00007846-n