Robin Hood-n
type: LexicalEntry
canonical form: Robin Hood
sense: 10554604-n
part of speech: noun

10554604-n
type: LexicalConcept
in scheme: en-word.net
definition: legendary English outlaw of the 12th century; said to have robbed the rich to help the poor
ili: i92610
lexfile: noun.person
part of speech: noun
instance hypernym: 09610740-n