rider-n
type: LexicalEntry
canonical form: rider
sense: 10549540-n
part of speech: noun

10549540-n
type: LexicalConcept
in scheme: en-word.net
definition: a traveler who actively rides an animal (as a horse or camel)
ili: i92575
lexfile: noun.person
part of speech: noun
hypernym: 09652940-n