pushover-n
type: LexicalEntry
canonical form: pushover
sense: 10515465-n
part of speech: noun

10515465-n
type: LexicalConcept
in scheme: en-word.net
definition: someone who is easily taken advantage of
ili: i92366
lexfile: noun.person
part of speech: noun
hypernym: 10117861-n