porter-n
type: LexicalEntry
canonical form: porter
sense: 10475013-n
part of speech: noun

10475013-n
type: LexicalConcept
in scheme: en-word.net
definition: a person employed to carry luggage and supplies
ili: i92139
lexfile: noun.person
part of speech: noun
hypernym: 10260997-n