politician-n
type: LexicalEntry
canonical form: politician
sense: 10470837-n
part of speech: noun

10470837-n
type: LexicalConcept
in scheme: en-word.net
definition: a leader engaged in civil administration
ili: i92117
lexfile: noun.person
part of speech: noun
hypernym: 09646208-n