partner-n
type: LexicalEntry
canonical form: partner
sense: 10422162-n
part of speech: noun

10422162-n
type: LexicalConcept
in scheme: en-word.net
definition: a person who is a member of a partnership
ili: i91875
lexfile: noun.person
part of speech: noun
hypernym: 09786620-n