officeholder-n
type: LexicalEntry
canonical form: officeholder
sense: 10391149-n
part of speech: noun

officer-n
type: LexicalEntry
canonical form: officer
sense: 10391149-n
part of speech: noun

10391149-n
type: LexicalConcept
in scheme: en-word.net
definition: someone who is appointed or elected to an office and who holds a position of trust
example: he is an officer of the court
example: the club elected its officers for the coming year
ili: i91704
lexfile: noun.person
part of speech: noun
hypernym: 10392072-n
hypernym: 10199809-n