mate-n
type: LexicalEntry
canonical form: mate
sense: 10319708-n
part of speech: noun

first mate-n
type: LexicalEntry
canonical form: first mate
sense: 10319708-n
part of speech: noun

10319708-n
type: LexicalConcept
in scheme: en-word.net
definition: the officer below the master on a commercial ship
ili: i91257
lexfile: noun.person
part of speech: noun
hypernym: 10391440-n