knocker-n
type: LexicalEntry
canonical form: knocker
sense: 10259625-n
part of speech: noun

10259625-n
type: LexicalConcept
in scheme: en-word.net
definition: (Yiddish) a big shot who knows it and acts that way; a boastful immoderate person
ili: i90883
lexfile: noun.person
part of speech: noun
exemplifies: 06963829-n
hypernym: 09873287-n