import-n
type: LexicalEntry
canonical form: import
sense: 10220150-n
part of speech: noun

importee-n
type: LexicalEntry
canonical form: importee
sense: 10220150-n
part of speech: noun

10220150-n
type: LexicalConcept
in scheme: en-word.net
definition: an imported person brought from a foreign country
example: the lead role was played by an import from Sweden
example: they are descendants of indentured importees
ili: i90668
lexfile: noun.person
part of speech: noun
hypernym: 10123254-n