hierarch-n
type: LexicalEntry
canonical form: hierarch
sense: 10189530-n
part of speech: noun

10189530-n
type: LexicalConcept
in scheme: en-word.net
definition: a person who holds a high position in a hierarchy
ili: i90476
lexfile: noun.person
part of speech: noun
hypernym: 10220400-n