evaluator-n
type: LexicalEntry
canonical form: evaluator
sense: 10086539-n
part of speech: noun

judge-n
type: LexicalEntry
canonical form: judge
sense: 10086539-n
part of speech: noun

10086539-n
type: LexicalConcept
in scheme: en-word.net
definition: an authority who is able to estimate worth or quality
ili: i89818
lexfile: noun.person
part of speech: noun
hypernym: 09843763-n