ecologist-n
type: LexicalEntry
canonical form: ecologist
sense: 10062971-n
part of speech: noun

10062971-n
type: LexicalConcept
in scheme: en-word.net
definition: a biologist who studies the relation between organisms and their environment
ili: i89682
lexfile: noun.person
part of speech: noun
hypernym: 09875036-n