dervish-n
type: LexicalEntry
canonical form: dervish
sense: 10025999-n
part of speech: noun

10025999-n
type: LexicalConcept
in scheme: en-word.net
definition: an ascetic Muslim monk; a member of an order noted for devotional exercises involving bodily movements
ili: i89481
lexfile: noun.person
part of speech: noun
hypernym: 10096087-n