critic-n
type: LexicalEntry
canonical form: critic
sense: 09998602-n
part of speech: noun

09998602-n
type: LexicalConcept
in scheme: en-word.net
definition: someone who frequently finds fault or makes harsh and unfair judgments
ili: i89314
lexfile: noun.person
part of speech: noun
exemplifies: 06730109-n
hypernym: 09654651-n