commentator-n
type: LexicalEntry
canonical form: commentator
sense: 09961910-n
part of speech: noun

reviewer-n
type: LexicalEntry
canonical form: reviewer
sense: 09961910-n
part of speech: noun

09961910-n
type: LexicalConcept
in scheme: en-word.net
definition: a writer who reports and analyzes events of the day
ili: i89105
lexfile: noun.person
part of speech: noun
hypernym: 10813654-n