caregiver-n
type: LexicalEntry
canonical form: caregiver
sense: 09915013-n
part of speech: noun

09915013-n
type: LexicalConcept
in scheme: en-word.net
definition: a person who is responsible for attending to the needs of a child or dependent adult
ili: i88830
lexfile: noun.person
part of speech: noun
hypernym: 09786620-n