baby-n
type: LexicalEntry
canonical form: baby
sense: 09846765-n
part of speech: noun

09846765-n
type: LexicalConcept
in scheme: en-word.net
definition: the youngest member of a group (not necessarily young)
example: the baby of the family
example: the baby of the Supreme Court
ili: i88381
lexfile: noun.person
part of speech: noun
hypernym: 10393697-n