archeologist-n
type: LexicalEntry
canonical form: archeologist
sense: 09824229-n
part of speech: noun

archaeologist-n
type: LexicalEntry
canonical form: archaeologist
sense: 09824229-n
part of speech: noun

09824229-n
type: LexicalConcept
in scheme: en-word.net
definition: an anthropologist who studies prehistoric people and their culture
ili: i88279
lexfile: noun.person
part of speech: noun
hypernym: 09815764-n