Arabist-n
type: LexicalEntry
canonical form: Arabist
sense: 09822374-n
part of speech: noun

09822374-n
type: LexicalConcept
in scheme: en-word.net
definition: a scholar who specializes in Arab languages and culture
ili: i88269
lexfile: noun.person
part of speech: noun
hypernym: 10577282-n