accessory-n
type: LexicalEntry
canonical form: accessory
sense: 09779206-n
part of speech: noun

accessary-n
type: LexicalEntry
canonical form: accessary
sense: 09779206-n
part of speech: noun

09779206-n
type: LexicalConcept
in scheme: en-word.net
definition: someone who helps another person commit a crime
ili: i88042
lexfile: noun.person
part of speech: noun
exemplifies: 06730109-n
hypernym: 09997190-n