leader-n
type: LexicalEntry
canonical form: leader
sense: 09646208-n
part of speech: noun

09646208-n
type: LexicalConcept
in scheme: en-word.net
definition: a person who rules or guides or inspires others
ili: i87225
lexfile: noun.person
part of speech: noun
hypernym: 09786620-n