lover-n
type: LexicalEntry
canonical form: lover
sense: 09645915-n
part of speech: noun

09645915-n
type: LexicalConcept
in scheme: en-word.net
definition: a significant other to whom you are not related by marriage
ili: i87223
lexfile: noun.person
part of speech: noun
hypernym: 10044087-n