John Henry-n
type: LexicalEntry
canonical form: John Henry
sense: 09614624-n
part of speech: noun

09614624-n
type: LexicalConcept
in scheme: en-word.net
definition: hero of American folk tales; portrayed as an enormously strong black man who worked on the railroads and died from exhaustion after winning a contest with a steam drill
ili: i87068
lexfile: noun.person
part of speech: noun
instance hypernym: 09610740-n