eon-n
type: LexicalEntry
canonical form: eon
sense: 09559695-n
part of speech: noun

aeon-n
type: LexicalEntry
canonical form: aeon
sense: 09559695-n
part of speech: noun

09559695-n
type: LexicalConcept
in scheme: en-word.net
definition: (Gnosticism) a divine power or nature emanating from the Supreme Being and playing various roles in the operation of the universe
ili: i86773
lexfile: noun.person
part of speech: noun
domain topic: 06232886-n
hypernym: 09527267-n