God-n
type: LexicalEntry
canonical form: God
sense: 09559169-n
part of speech: noun

Supreme Being-n
type: LexicalEntry
canonical form: Supreme Being
sense: 09559169-n
part of speech: noun

09559169-n
type: LexicalConcept
in scheme: en-word.net
definition: the supernatural being conceived as the perfect and omnipotent and omniscient originator and ruler of the universe; the object of worship in monotheistic religions
ili: i86771
lexfile: noun.person
part of speech: noun
instance hypernym: 09527267-n