Hypnos-n
type: LexicalEntry
canonical form: Hypnos
sense: 09519804-n
part of speech: noun

09519804-n
type: LexicalConcept
in scheme: en-word.net
definition: (Greek mythology) the Greek god of sleep; the son of Nyx
ili: i86525
lexfile: noun.person
part of speech: noun
domain topic: 07995848-n
instance hypernym: 09528550-n