unit-n
type: LexicalEntry
canonical form: unit
sense: 09488589-n
part of speech: noun

building block-n
type: LexicalEntry
canonical form: building block
sense: 09488589-n
part of speech: noun

09488589-n
type: LexicalConcept
in scheme: en-word.net
definition: a single undivided natural thing occurring in the composition of something else
example: units of nucleic acids
ili: i86364
lexfile: noun.object
part of speech: noun
hypernym: 00002452-n
mero part: 09408804-n