star-n
type: LexicalEntry
canonical form: star
sense: 09467687-n
part of speech: noun

09467687-n
type: LexicalConcept
in scheme: en-word.net
definition: any celestial body visible (as a point of light) from the Earth at night
ili: i86240
lexfile: noun.object
part of speech: noun
hypernym: 09262646-n