shoal-n
type: LexicalEntry
canonical form: shoal
sense: 09456216-n
part of speech: noun

09456216-n
type: LexicalConcept
in scheme: en-word.net
definition: a sandbank in a stretch of water that is visible at low tide
ili: i86177
lexfile: noun.object
part of speech: noun
hypernym: 09444677-n