shiner-n
type: LexicalEntry
canonical form: shiner
sense: 09455894-n
part of speech: noun

09455894-n
type: LexicalConcept
in scheme: en-word.net
definition: something that shines (with emitted or reflected light)
ili: i86175
lexfile: noun.object
part of speech: noun
hypernym: 00002684-n