segment-n
type: LexicalEntry
canonical form: segment
sense: 09452291-n
part of speech: noun

09452291-n
type: LexicalConcept
in scheme: en-word.net
definition: one of the parts into which something naturally divides
example: a segment of an orange
ili: i86153
lexfile: noun.object
part of speech: noun
hypernym: 09408804-n