particle-n
type: LexicalEntry
canonical form: particle
sense: 09409315-n
part of speech: noun

subatomic particle-n
type: LexicalEntry
canonical form: subatomic particle
sense: 09409315-n
part of speech: noun

09409315-n
type: LexicalConcept
in scheme: en-word.net
definition: a body having finite mass and internal structure but negligible dimensions
ili: i85947
lexfile: noun.object
part of speech: noun
hypernym: 09247818-n