Korea Bay-n
type: LexicalEntry
canonical form: Korea Bay
sense: 09350107-n
part of speech: noun

09350107-n
type: LexicalConcept
in scheme: en-word.net
definition: an inlet of the Yellow Sea between the Liaodong Peninsula in China and western Korea
ili: i85638
lexfile: noun.object
part of speech: noun
instance hypernym: 09238571-n